C Error 2065

Compiler Errors C2001 through C2099 Compiler Error C2065. Compiler. Compiling C++ Standard Library code with a debug version of the.

RECOMMENDED: If you have Windows errors then we strongly recommend that you download and run this (Windows) Repair Tool.

Compiler Errors C2001 through C2099 Compiler Error C2065. Compiler. Compiling C++ Standard Library code with a debug version of the C runtime implies.

Bada Error Code 0114 Google Maps Error Messages Gentoo Genkernel Busybox Error GNU/Linux – Wonderfully done gentoo based distro using customized XFCE desktop The

While analyzing the source codes of various programs I can’t help creating associations that each program has a tendency to certain diseases. In many projects. the buffer ‘state->m_control_0’. tumbleb.c 2065 The.

Berg River Municipality v Zelpy 2065 (Pty) Ltd (7715/12. – Berg River Municipality v Zelpy 2065 (Pty) Ltd (7715/12) [2013] ZAWCHC 53; 2013 (4) SA 154 (WCC) (8 April 2013)

Net View Error 5 Access Denied Feb 11, 2011. This will make Windows use that password for all connections to your specified server, whether you make

Boxplots and statistical indexes (centered root mean squared error, correlation coefficient and standard deviation).

. or delay only if no significant aspect of the error or delay can be attributed to the taxpayer and after the.

Quicktime Error 2041 An Invalid. more entries*/ dceExtErr = -30, /*dce extension error*/ slotNumErr = -360, /* invalid. only data */ }; /*QuickTime errors*/

Real guests, real opinions, really useful hotel reviews for Holiday Inn Washington-Capitol. Our hotel reviews are authentic and unedited from travelers just like you.

The best way to see Cardiff! Join us for a 50-minute City Sightseeing hop-on hop-off bus tour, including Cardiff Castle, Techniquest and Millennium Stadium. This is a.

This is an example of code that works when you build in Debug, but not Retail: This error can occur when calling a generic function, if the intended type argument cannot be deduced from the parameters used. For more information,

input.c(375) : error C2146: syntax error : missing ‘;’ before identifier ‘datelo’ input.c(375) : error C2065: ‘datelo’ : undeclared identifier input.c(376) : error C2146: syntax error : missing ‘;’ before identifier ‘datehi’ input.c(376) : error.

City Sightseeing Oxford Hop-On Hop-Off Tour 2017 – Viator.com – Discover the beautiful city of Oxford with a City Sightseeing hop-on hop-off bus tour. An easy and convenient way to travel between sights, your ticket offers.

Mar 5, 2014. In C and C++ all names have to be declared before they are used. For the Visual Studio compiler: error C2065: 'printf' : undeclared identifier.

c – Why do I get "error undeclared identifier" unless I declare my. – Jan 23, 2011. In C, at least back in the old days, variable declarations have to come at the top of the block. C++ is different in that regard. edit — apparently.

RECOMMENDED: Click here to fix Windows errors and improve system performance

This article was written by Armando